Target
UDP-N-acetylmuramoyl-tripeptide--D-alanyl-D-alanine ligase
Ligand
BDBM50371275
Substrate
Meas. Tech.
ChEMBL_463171 (CHEMBL946187)
IC50
>5000000±n/a nM
Citation
 Taha, MOAtallah, NAl-Bakri, AGParadis-Bleau, CZalloum, HYounis, KSLevesque, RC Discovery of new MurF inhibitors via pharmacophore modeling and QSAR analysis followed by in-silico screening. Bioorg Med Chem 16:1218-35 (2008)  
Target
Name:
UDP-N-acetylmuramoyl-tripeptide--D-alanyl-D-alanine ligase
Synonyms:
Type:
PROTEIN
Mol. Mass.:
47381.53
Organism:
Pseudomonas aeruginosa
Description:
ChEMBL_463171
Residue:
458
  
Inhibitor
Name:
BDBM50371275
Synonyms:
CHEMBL270112 | NSC-17251
Type:
Small organic molecule
Emp. Form.:
C28H32ClNO8
Mol. Mass.:
546.009
SMILES:
C[C@]12C[C@H](O)[C@H]3[C@@H](CCC4=CC(=O)CC[C@]34C)[C@@H]1CC[C@]2(O)C(=O)COC(=O)c1cc(ccc1Cl)[N+]([O-])=O
: