Target
Receptor tyrosine-protein kinase erbB-2
Ligand
BDBM50371358
Substrate
Meas. Tech.
ChEMBL_463276 (CHEMBL930777)
IC50
2±n/a nM
Citation
 Barlaam, BBallard, PBradbury, RHDucray, RGermain, HHickinson, DMHudson, KKettle, JGKlinowska, TMagnien, FOgilvie, DJOlivier, APearson, SEScott, JSSuleman, ATrigwell, CBVautier, MWhittaker, RDWood, R A new series of neutral 5-substituted 4-anilinoquinazolines as potent, orally active inhibitors of erbB2 receptor tyrosine kinase. Bioorg Med Chem Lett 18:674-8 (2008)  
Target
Name:
Receptor tyrosine-protein kinase erbB-2
Synonyms:
2.7.10.1 CD_antigen=CD340 ERBB2_HUMAN FASN/HER2 HER2 MLN19 NEU Proto-oncogene Neu Tyrosine kinase-type cell surface receptor HER2 | p185erbB2
Type:
Mol. Mass.:
137894.47
Organism:
Homo sapiens (Human)
Description:
P04626
Residue:
1255
  
Inhibitor
Name:
BDBM50371358
Synonyms:
CHEMBL257478
Type:
Small organic molecule
Emp. Form.:
C27H29N5O4
Mol. Mass.:
487.5503
SMILES:
C[C@@H](Oc1cccc2ncnc(Nc3ccc(Oc4ccc(C)nc4)c(C)c3)c12)C(=O)N(C)CCO
: