Target
Gag-Pro polyprotein
Ligand
BDBM50371725
Substrate
Meas. Tech.
ChEMBL_463999 (CHEMBL929986)
IC50
102±n/a nM
Citation
 Nguyen, JTZhang, MKumada, HOItami, ANishiyama, KKimura, TCheng, MHayashi, YKiso, Y Truncation and non-natural amino acid substitution studies on HTLV-I protease hexapeptidic inhibitors. Bioorg Med Chem Lett 18:366-70 (2008)  
Target
Name:
Gag-Pro polyprotein
Synonyms:
Human T-cell leukemia virus type I protease gag-pro | prt
Type:
PROTEIN
Mol. Mass.:
71577.03
Organism:
Human T-cell leukemia virus 1 (strain Japan ATK-1 subtype A) (HTLV-1)
Description:
ChEMBL_303297
Residue:
651
  
Inhibitor
Name:
BDBM50371725
Synonyms:
CHEMBL403182 | KNI-10199
Type:
Small organic molecule
Emp. Form.:
C43H63N7O8S2
Mol. Mass.:
870.132
SMILES:
CC[C@H](C)[C@H](NC(=O)[C@@H](NC(C)=O)c1ccccc1)C(=O)N[C@@H](Cc1ccccc1)[C@H](O)C(=O)N1CSC(C)(C)[C@@H]1C(=O)N[C@@H]([C@@H](C)CC)C(=O)N[C@@H](CCSC)C(N)=O
: