Target
Gag-Pro polyprotein
Ligand
BDBM50371729
Substrate
Meas. Tech.
ChEMBL_463999 (CHEMBL929986)
IC50
152±n/a nM
Citation
 Nguyen, JTZhang, MKumada, HOItami, ANishiyama, KKimura, TCheng, MHayashi, YKiso, Y Truncation and non-natural amino acid substitution studies on HTLV-I protease hexapeptidic inhibitors. Bioorg Med Chem Lett 18:366-70 (2008)  
Target
Name:
Gag-Pro polyprotein
Synonyms:
Human T-cell leukemia virus type I protease gag-pro | prt
Type:
PROTEIN
Mol. Mass.:
71577.03
Organism:
Human T-cell leukemia virus 1 (strain Japan ATK-1 subtype A) (HTLV-1)
Description:
ChEMBL_303297
Residue:
651
  
Inhibitor
Name:
BDBM50371729
Synonyms:
CHEMBL436816
Type:
Small organic molecule
Emp. Form.:
C47H71N11O11S2
Mol. Mass.:
1030.264
SMILES:
CSCC[C@H](NC(=O)[C@@H](NC(=O)[C@H]1N(CSC1(C)C)C(=O)[C@@H](O)[C@H](Cc1ccccc1)NC(=O)[C@@H](NC(=O)[C@H](CCC(N)=O)NC(=O)[C@@H]1CCCN1)C(C)C)C(C)C)C(=O)N[C@@H](Cc1cnc[nH]1)C(O)=O
: