Target
Chymase
Ligand
BDBM50329819
Substrate
Meas. Tech.
ChEMBL_464567 (CHEMBL933253)
IC50
3530±n/a nM
Citation
 Dorsey, BDIqbal, MChatterjee, SMenta, EBernardini, RBernareggi, ACassarà, PGD'Arasmo, GFerretti, EDe Munari, SOliva, APezzoni, GAllievi, CStrepponi, IRuggeri, BAtor, MAWilliams, MMallamo, JP Discovery of a potent, selective, and orally active proteasome inhibitor for the treatment of cancer. J Med Chem 51:1068-72 (2008)  
Target
Name:
Chymase
Synonyms:
Alpha-chymase CMA1_HUMAN CYM Mast cell protease I
Type:
Enzyme
Mol. Mass.:
27340.12
Organism:
Homo sapiens (Human)
Description:
Residue:
247
  
Inhibitor
Name:
BDBM50329819
Synonyms:
(R)-1-((2S,3R)-3-hydroxy-2-(6-phenylpicolinamido)butanamido)-3-methylbutylboronic acid CHEMBL270515 | [(1R)-1-[[(2S,3R)-3-hydroxy-2-[(6-phenylpyridine-2-carbonyl)amino]-1-oxobutyl]amino]-3-methylbutyl]boronic acid
Type:
Small organic molecule
Emp. Form.:
C21H28BN3O5
Mol. Mass.:
413.275
SMILES:
CC(C)C[C@H](NC(=O)[C@@H](NC(=O)c1cccc(n1)-c1ccccc1)[C@@H](C)O)B(O)O
: