Target
Androgen receptor
Ligand
BDBM50372080
Substrate
Meas. Tech.
ChEMBL_464720 (CHEMBL933063)
Ki
17±n/a nM
Citation
 Salvati, MEBalog, AShan, WRampulla, RGiese, SMitt, TFurch, JAVite, GDAttar, RMJure-Kunkel, MGeng, JRizzo, CAGottardis, MMKrystek, SRGougoutas, JGalella, MAObermeier, MFura, AChandrasena, G Identification and optimization of a novel series of [2.2.1]-oxabicyclo imide-based androgen receptor antagonists. Bioorg Med Chem Lett 18:1910-5 (2008)  
Target
Name:
Androgen receptor
Synonyms:
ANDR_HUMAN Androgen Receptor Androgen receptor/Baculoviral IAP repeat-containing protein 2 Dihydrotestosterone receptor Nuclear receptor subfamily 3 group C member 4
Type:
Receptor
Mol. Mass.:
99185.27
Organism:
Homo sapiens (Human)
Description:
CHO cells were stably transfected with human AR gene.
Residue:
920
  
Inhibitor
Name:
BDBM50372080
Synonyms:
CHEMBL403039
Type:
Small organic molecule
Emp. Form.:
C20H17BrN2O5
Mol. Mass.:
445.263
SMILES:
CC12CCC(C)(O1)c1c(O)n(c(O)c21)-c1ccc([N+]([O-])=O)c2c(Br)cccc12
: