Target
Androgen receptor
Ligand
BDBM50156506
Substrate
Meas. Tech.
ChEMBL_464720 (CHEMBL933063)
Ki
40±n/a nM
Citation
 Salvati, MEBalog, AShan, WRampulla, RGiese, SMitt, TFurch, JAVite, GDAttar, RMJure-Kunkel, MGeng, JRizzo, CAGottardis, MMKrystek, SRGougoutas, JGalella, MAObermeier, MFura, AChandrasena, G Identification and optimization of a novel series of [2.2.1]-oxabicyclo imide-based androgen receptor antagonists. Bioorg Med Chem Lett 18:1910-5 (2008)  
Target
Name:
Androgen receptor
Synonyms:
ANDR_HUMAN Androgen Receptor Androgen receptor/Baculoviral IAP repeat-containing protein 2 Dihydrotestosterone receptor Nuclear receptor subfamily 3 group C member 4
Type:
Receptor
Mol. Mass.:
99185.27
Organism:
Homo sapiens (Human)
Description:
CHO cells were stably transfected with human AR gene.
Residue:
920
  
Inhibitor
Name:
BDBM50156506
Synonyms:
(1S,6S,7S)-4-(4-Cyano-3-trifluoromethyl-phenyl)-3,5-dioxo-2,4,8-triaza-tricyclo[5.2.1.0*2,6*]decane-8-carboxylic acid tert-butyl ester CHEMBL414845
Type:
Small organic molecule
Emp. Form.:
C20H19F3N4O4
Mol. Mass.:
436.3845
SMILES:
CC(C)(C)OC(=O)N1C[C@@H]2C[C@H]1c1c(O)n(-c3ccc(C#N)c(c3)C(F)(F)F)c(=O)n21
: