Target
Androgen receptor
Ligand
BDBM50158073
Substrate
Meas. Tech.
ChEMBL_464720 (CHEMBL933063)
Ki
360±n/a nM
Citation
 Salvati, MEBalog, AShan, WRampulla, RGiese, SMitt, TFurch, JAVite, GDAttar, RMJure-Kunkel, MGeng, JRizzo, CAGottardis, MMKrystek, SRGougoutas, JGalella, MAObermeier, MFura, AChandrasena, G Identification and optimization of a novel series of [2.2.1]-oxabicyclo imide-based androgen receptor antagonists. Bioorg Med Chem Lett 18:1910-5 (2008)  
Target
Name:
Androgen receptor
Synonyms:
ANDR_HUMAN Androgen Receptor Androgen receptor/Baculoviral IAP repeat-containing protein 2 Dihydrotestosterone receptor Nuclear receptor subfamily 3 group C member 4
Type:
Receptor
Mol. Mass.:
99185.27
Organism:
Homo sapiens (Human)
Description:
CHO cells were stably transfected with human AR gene.
Residue:
920
  
Inhibitor
Name:
BDBM50158073
Synonyms:
(2R,6S)-4-[3-(trifluoromethyl)phenyl]-4-azatricyclo[5.2.1.0~2,6~]decane-3,5-dione (2S,6R)-4-(3-trifluoromethyl-phenyl)-4-aza-tricyclo[5.2.1.02,6]decane-3,5-dione | CHEMBL367364
Type:
Small organic molecule
Emp. Form.:
C16H14F3NO2
Mol. Mass.:
309.2831
SMILES:
Oc1c2C3CCC(C3)c2c(O)n1-c1cccc(c1)C(F)(F)F
: