Target
Adenosine receptor A2a
Ligand
BDBM50372567
Substrate
Meas. Tech.
ChEMBL_465258 (CHEMBL930529)
Ki
5±n/a nM
Citation
 Moorjani, MZhang, XChen, YLin, ERueter, JKGross, RSLanier, MCTellew, JEWilliams, JPLechner, SMMalany, SSantos, MEkhlassi, PCastro-Palomino, JCCrespo, MIPrat, MGual, SDíaz, JLSaunders, JSlee, DH 2,6-Diaryl-4-phenacylaminopyrimidines as potent and selective adenosine A(2A) antagonists with reduced hERG liability. Bioorg Med Chem Lett 18:1269-73 (2008)  
Target
Name:
Adenosine receptor A2a
Synonyms:
A2A adenosine receptor (hA2A) ADENOSINE A2 ADORA2 Adenosine A2A receptor (A2AAR)
Type:
G Protein-Coupled Receptor (GPCR)
Mol. Mass.:
44716.46
Organism:
Homo sapiens (Human)
Description:
P29274
Residue:
412
  
Inhibitor
Name:
BDBM50372567
Synonyms:
CHEMBL255569
Type:
Small organic molecule
Emp. Form.:
C22H19F2N5O2
Mol. Mass.:
423.4154
SMILES:
Cc1cc(C)n(n1)-c1cc(NC(=O)Cc2ccc(F)c(F)c2)nc(n1)-c1ccc(C)o1
: