Target
Adenosine receptor A2a
Ligand
BDBM50372575
Substrate
Meas. Tech.
ChEMBL_465258 (CHEMBL930529)
Ki
1±n/a nM
Citation
 Moorjani, MZhang, XChen, YLin, ERueter, JKGross, RSLanier, MCTellew, JEWilliams, JPLechner, SMMalany, SSantos, MEkhlassi, PCastro-Palomino, JCCrespo, MIPrat, MGual, SDíaz, JLSaunders, JSlee, DH 2,6-Diaryl-4-phenacylaminopyrimidines as potent and selective adenosine A(2A) antagonists with reduced hERG liability. Bioorg Med Chem Lett 18:1269-73 (2008)  
Target
Name:
Adenosine receptor A2a
Synonyms:
A2A adenosine receptor (hA2A) ADENOSINE A2 ADORA2 Adenosine A2A receptor (A2AAR)
Type:
G Protein-Coupled Receptor (GPCR)
Mol. Mass.:
44716.46
Organism:
Homo sapiens (Human)
Description:
P29274
Residue:
412
  
Inhibitor
Name:
BDBM50372575
Synonyms:
CHEMBL256382
Type:
Small organic molecule
Emp. Form.:
C21H17N5O2S
Mol. Mass.:
403.457
SMILES:
COc1ccc(CC(=O)Nc2cc(nc(n2)-c2ccccn2)-c2nccs2)cc1
: