Target
Beta-3 adrenergic receptor
Ligand
BDBM50236160
Substrate
Meas. Tech.
ChEMBL_465621 (CHEMBL951065)
EC50
0.290000±n/a nM
Citation
 Imanishi, MTomishima, YItou, SHamashima, HNakajima, YWashizuka, KSakurai, MMatsui, SImamura, EUeshima, KYamamoto, TYamamoto, NIshikawa, HNakano, KUnami, NHamada, KMatsumura, YTakamura, FHattori, K Discovery of a novel series of biphenyl benzoic acid derivatives as potent and selective human beta3-adrenergic receptor agonists with good oral bioavailability. Part I. J Med Chem 51:1925-44 (2008)  
Target
Name:
Beta-3 adrenergic receptor
Synonyms:
ADRB3 ADRB3_HUMAN Beta-2 adrenergic receptor and beta-3 adrenergic receptor Beta-3 adrenoreceptor | adrenergic Beta3
Type:
G Protein-Coupled Receptor (GPCR)
Mol. Mass.:
43534.88
Organism:
Homo sapiens (Human)
Description:
Residue:
408
  
Inhibitor
Name:
BDBM50236160
Synonyms:
(R)-4'-(2-(2-hydroxy-2-phenylethylamino)ethyl)-3-(isopropylamino)biphenyl-4-carboxylic acid CHEMBL270964
Type:
Small organic molecule
Emp. Form.:
C26H30N2O3
Mol. Mass.:
418.528
SMILES:
CC(C)Nc1cc(ccc1C(O)=O)-c1ccc(CCNC[C@H](O)c2ccccc2)cc1
: