Target
Vascular endothelial growth factor receptor 2
Ligand
BDBM50372707
Substrate
Meas. Tech.
ChEMBL_465745 (CHEMBL948989)
IC50
>25000±n/a nM
Citation
 Deak, HLNewcomb, JRNunes, JJBoucher, CCheng, ACDiMauro, EFEpstein, LFGallant, PHodous, BLHuang, XLee, JHPatel, VFSchneider, STurci, SMZhu, X N-(3-(phenylcarbamoyl)arylpyrimidine)-5-carboxamides as potent and selective inhibitors of Lck: structure, synthesis and SAR. Bioorg Med Chem Lett 18:1172-6 (2008)  
Target
Name:
Vascular endothelial growth factor receptor 2
Synonyms:
CD_antigen=CD309 Fetal liver kinase 1 (FLK-1) KDR Protein-tyrosine kinase receptor Flk-1 VEGFR-2 VEGFR2 Vascular Endothelial Growth Factor Receptor Kinase 2 Vascular endothelial growth factor receptor 2 (KDR) Vascular endothelial growth factor receptor 2 (VEGFR2) Vascular endothelial growth factor receptor-2 (VEGFR-2)
Type:
Receptor Tyrosine Kinase
Mol. Mass.:
151510.97
Organism:
Homo sapiens (Human)
Description:
P35968
Residue:
1356
  
Inhibitor
Name:
BDBM50372707
Synonyms:
CHEMBL408292
Type:
Small organic molecule
Emp. Form.:
C32H31F3N6O4
Mol. Mass.:
620.6215
SMILES:
Cc1ccc(cc1NC(=O)c1cnc(NCCN2CCOCC2)nc1Oc1ccccc1)C(=O)Nc1cccc(c1)C(F)(F)F
: