Target
Vascular endothelial growth factor receptor 2
Ligand
BDBM50372716
Substrate
Meas. Tech.
ChEMBL_465745 (CHEMBL948989)
IC50
8330±n/a nM
Citation
 Deak, HLNewcomb, JRNunes, JJBoucher, CCheng, ACDiMauro, EFEpstein, LFGallant, PHodous, BLHuang, XLee, JHPatel, VFSchneider, STurci, SMZhu, X N-(3-(phenylcarbamoyl)arylpyrimidine)-5-carboxamides as potent and selective inhibitors of Lck: structure, synthesis and SAR. Bioorg Med Chem Lett 18:1172-6 (2008)  
Target
Name:
Vascular endothelial growth factor receptor 2
Synonyms:
CD_antigen=CD309 Fetal liver kinase 1 (FLK-1) KDR Protein-tyrosine kinase receptor Flk-1 VEGFR-2 VEGFR2 Vascular Endothelial Growth Factor Receptor Kinase 2 Vascular endothelial growth factor receptor 2 (KDR) Vascular endothelial growth factor receptor 2 (VEGFR2) Vascular endothelial growth factor receptor-2 (VEGFR-2)
Type:
Receptor Tyrosine Kinase
Mol. Mass.:
151510.97
Organism:
Homo sapiens (Human)
Description:
P35968
Residue:
1356
  
Inhibitor
Name:
BDBM50372716
Synonyms:
CHEMBL271018
Type:
Small organic molecule
Emp. Form.:
C22H20F3N5O3
Mol. Mass.:
459.4211
SMILES:
CNc1ncc(C(=O)Nc2cc(ccc2C)C(=O)Nc2cccc(c2)C(F)(F)F)c(OC)n1
: