Target
Tyrosine-protein kinase JAK3
Ligand
BDBM50372711
Substrate
Meas. Tech.
ChEMBL_465747 (CHEMBL948991)
IC50
>25000±n/a nM
Citation
 Deak, HLNewcomb, JRNunes, JJBoucher, CCheng, ACDiMauro, EFEpstein, LFGallant, PHodous, BLHuang, XLee, JHPatel, VFSchneider, STurci, SMZhu, X N-(3-(phenylcarbamoyl)arylpyrimidine)-5-carboxamides as potent and selective inhibitors of Lck: structure, synthesis and SAR. Bioorg Med Chem Lett 18:1172-6 (2008)  
Target
Name:
Tyrosine-protein kinase JAK3
Synonyms:
JAK-3 JAK3_HUMAN Janus kinase 3 (JAK3) L-JAK | Leukocyte janus kinase
Type:
Protein
Mol. Mass.:
125111.08
Organism:
Homo sapiens (Human)
Description:
P52333
Residue:
1124
  
Inhibitor
Name:
BDBM50372711
Synonyms:
CHEMBL270793
Type:
Small organic molecule
Emp. Form.:
C27H29F3N6O4
Mol. Mass.:
558.5522
SMILES:
COc1nc(NCCN2CCOCC2)ncc1C(=O)Nc1cc(ccc1C)C(=O)Nc1cccc(c1)C(F)(F)F
: