Target
Glycogen synthase kinase-3 beta
Ligand
BDBM8359
Substrate
Meas. Tech.
ChEMBL_466615 (CHEMBL930273)
IC50
1±n/a nM
Citation
 Taha, MOBustanji, YAl-Ghussein, MAMohammad, MZalloum, HAl-Masri, IMAtallah, N Pharmacophore modeling, quantitative structure-activity relationship analysis, and in silico screening reveal potent glycogen synthase kinase-3beta inhibitory activities for cimetidine, hydroxychloroquine, and gemifloxacin. J Med Chem 51:2062-77 (2008)  
Target
Name:
Glycogen synthase kinase-3 beta
Synonyms:
GSK-3 beta GSK3B Glycogen synthase kinase 3 beta (GSK3B) Glycogen synthase kinase-3 beta (GSK-3B) Glycogen synthase kinase-3 beta (GSK3B) Glycogen synthase kinase-3beta (GSK3B) | Serine/threonine-protein kinase GSK3B
Type:
Enzyme
Mol. Mass.:
46756.38
Organism:
Homo sapiens (Human)
Description:
P49841
Residue:
420
  
Inhibitor
Name:
BDBM8359
Synonyms:
6-aryl-pyrazolo[3,4-b]pyridine analogue 23 | N-[5-bromo-6-(4-hydroxyphenyl)-1H-pyrazolo[3,4-b]pyridin-3-yl]-1-methylpiperidine-4-carboxamide
Type:
Small organic molecule
Emp. Form.:
C19H20BrN5O2
Mol. Mass.:
430.298
SMILES:
CN1CCC(CC1)C(=O)Nc1n[nH]c2nc(c(Br)cc12)-c1ccc(O)cc1
: