Target
Glycogen synthase kinase-3 beta
Ligand
BDBM8341
Substrate
Meas. Tech.
ChEMBL_466615 (CHEMBL930273)
IC50
8±n/a nM
Citation
 Taha, MOBustanji, YAl-Ghussein, MAMohammad, MZalloum, HAl-Masri, IMAtallah, N Pharmacophore modeling, quantitative structure-activity relationship analysis, and in silico screening reveal potent glycogen synthase kinase-3beta inhibitory activities for cimetidine, hydroxychloroquine, and gemifloxacin. J Med Chem 51:2062-77 (2008)  
Target
Name:
Glycogen synthase kinase-3 beta
Synonyms:
GSK-3 beta GSK3B Glycogen synthase kinase 3 beta (GSK3B) Glycogen synthase kinase-3 beta (GSK-3B) Glycogen synthase kinase-3 beta (GSK3B) Glycogen synthase kinase-3beta (GSK3B) | Serine/threonine-protein kinase GSK3B
Type:
Enzyme
Mol. Mass.:
46756.38
Organism:
Homo sapiens (Human)
Description:
P49841
Residue:
420
  
Inhibitor
Name:
BDBM8341
Synonyms:
6-aryl-pyrazolo[3,4-b]pyridine analogue 5 pyrazolo[3,4-b]pyridine analogue 5
Type:
Small organic molecule
Emp. Form.:
C16H14N4O2
Mol. Mass.:
294.308
SMILES:
Oc1ccc(cc1)-c1ccc2c(NC(=O)C3CC3)n[nH]c2n1
: