Target
Glycogen synthase kinase-3 beta
Ligand
BDBM8334
Substrate
Meas. Tech.
ChEMBL_466615 (CHEMBL930273)
IC50
5±n/a nM
Citation
 Taha, MOBustanji, YAl-Ghussein, MAMohammad, MZalloum, HAl-Masri, IMAtallah, N Pharmacophore modeling, quantitative structure-activity relationship analysis, and in silico screening reveal potent glycogen synthase kinase-3beta inhibitory activities for cimetidine, hydroxychloroquine, and gemifloxacin. J Med Chem 51:2062-77 (2008)  
Target
Name:
Glycogen synthase kinase-3 beta
Synonyms:
GSK-3 beta GSK3B Glycogen synthase kinase 3 beta (GSK3B) Glycogen synthase kinase-3 beta (GSK-3B) Glycogen synthase kinase-3 beta (GSK3B) Glycogen synthase kinase-3beta (GSK3B) | Serine/threonine-protein kinase GSK3B
Type:
Enzyme
Mol. Mass.:
46756.38
Organism:
Homo sapiens (Human)
Description:
P49841
Residue:
420
  
Inhibitor
Name:
BDBM8334
Synonyms:
5-(4-ethylpiperazin-1-yl)-N-{5-phenyl-1H-pyrazolo[3,4-c]pyridazin-3-yl}pentanamide | pyrazolopyridazine deriv. 14
Type:
Small organic molecule
Emp. Form.:
C22H29N7O
Mol. Mass.:
407.512
SMILES:
CCN1CCN(CCCCC(=O)Nc2n[nH]c3nnc(cc23)-c2ccccc2)CC1
: