Target
Quorum-sensing transcriptional repressor QscR
Ligand
BDBM50351510
Substrate
Meas. Tech.
ChEMBL_466841 (CHEMBL925889)
EC50
78±n/a nM
Citation
 Mattmann, MEGeske, GDWorzalla, GAChandler, JRSappington, KJGreenberg, EPBlackwell, HE Synthetic ligands that activate and inhibit a quorum-sensing regulator in Pseudomonas aeruginosa. Bioorg Med Chem Lett 18:3072-5 (2008)  
Target
Name:
Quorum-sensing transcriptional repressor QscR
Synonyms:
PhzR
Type:
PROTEIN
Mol. Mass.:
27251.33
Organism:
Pseudomonas aeruginosa
Description:
ChEMBL_466843
Residue:
237
  
Inhibitor
Name:
BDBM50351510
Synonyms:
CHEMBL8463
Type:
Small organic molecule
Emp. Form.:
C18H31NO4
Mol. Mass.:
325.443
SMILES:
CCCCCCCCCCCC(=O)CC(=O)N[C@H]1CCOC1=O
: