Target
6-phosphogluconate dehydrogenase, decarboxylating
Ligand
BDBM50236531
Substrate
Meas. Tech.
ChEMBL_467396 (CHEMBL921930)
IC50
1450±n/a nM
Citation
 Shin, ESPark, JShin, JMCho, DCho, SYShin, DWHam, MKim, JBLee, TR Catechin gallates are NADP+-competitive inhibitors of glucose-6-phosphate dehydrogenase and other enzymes that employ NADP+ as a coenzyme. Bioorg Med Chem 16:3580-6 (2008)  
Target
Name:
6-phosphogluconate dehydrogenase, decarboxylating
Synonyms:
6-phosphogluconate dehydrogenase 6PGD_HUMAN PGDH
Type:
Protein
Mol. Mass.:
53143.42
Organism:
Homo sapiens (Human)
Description:
P52209
Residue:
483
  
Inhibitor
Name:
BDBM50236531
Synonyms:
(-)-gallocatechin gallate (2S,3R)-5,7-dihydroxy-2-(3,4,5-trihydroxyphenyl)-3,4-dihydro-2H-chromen-3-yl 3,4,5-trihydroxybenzoate CHEMBL264938 gallocatechin gallate
Type:
Small organic molecule
Emp. Form.:
C22H18O11
Mol. Mass.:
458.3717
SMILES:
Oc1cc(O)c2C[C@@H](OC(=O)c3cc(O)c(O)c(O)c3)[C@@H](Oc2c1)c1cc(O)c(O)c(O)c1
: