Target
Pituitary adenylate cyclase-activating polypeptide type I receptor
Ligand
BDBM50374184
Substrate
Meas. Tech.
ChEMBL_469030 (CHEMBL949341)
Ki
140±n/a nM
Citation
 Beebe, XDarczak, DDavis-Taber, RAUchic, MEScott, VEJarvis, MFStewart, AO Discovery and SAR of hydrazide antagonists of the pituitary adenylate cyclase-activating polypeptide (PACAP) receptor type 1 (PAC1-R). Bioorg Med Chem Lett 18:2162-6 (2008)  
Target
Name:
Pituitary adenylate cyclase-activating polypeptide type I receptor
Synonyms:
ADCYAP1R1 | PACR_HUMAN
Type:
PROTEIN
Mol. Mass.:
53307.50
Organism:
Homo sapiens (Human)
Description:
ChEMBL_498617
Residue:
468
  
Inhibitor
Name:
BDBM50374184
Synonyms:
CHEMBL270677
Type:
Small organic molecule
Emp. Form.:
C24H20ClF3N2O5
Mol. Mass.:
508.874
SMILES:
COc1cc(\C=N\NC(=O)c2ccc(O)c(Cl)c2)cc(OC)c1OCc1ccc(cc1)C(F)(F)F
: