Target
Pituitary adenylate cyclase-activating polypeptide type I receptor
Ligand
BDBM50110068
Substrate
Meas. Tech.
ChEMBL_469030 (CHEMBL949341)
Ki
56±n/a nM
Citation
 Beebe, XDarczak, DDavis-Taber, RAUchic, MEScott, VEJarvis, MFStewart, AO Discovery and SAR of hydrazide antagonists of the pituitary adenylate cyclase-activating polypeptide (PACAP) receptor type 1 (PAC1-R). Bioorg Med Chem Lett 18:2162-6 (2008)  
Target
Name:
Pituitary adenylate cyclase-activating polypeptide type I receptor
Synonyms:
ADCYAP1R1 | PACR_HUMAN
Type:
PROTEIN
Mol. Mass.:
53307.50
Organism:
Homo sapiens (Human)
Description:
ChEMBL_498617
Residue:
468
  
Inhibitor
Name:
BDBM50110068
Synonyms:
3-Chloro-4-hydroxy-benzoic acid [1-[4-(4-isopropyl-benzyloxy)-3,5-dimethoxy-phenyl]-meth-(E)-ylidene]-hydrazide N'-(4-(4-isopropylbenzyloxy)-3,5-dimethoxybenzylidene)-3-chloro-4-hydroxybenzohydrazide
Type:
Small organic molecule
Emp. Form.:
C26H27ClN2O5
Mol. Mass.:
482.956
SMILES:
COc1cc(\C=N\NC(=O)c2ccc(O)c(Cl)c2)cc(OC)c1OCc1ccc(cc1)C(C)C
: