Target
MAP kinase-activated protein kinase 2
Ligand
BDBM50374691
Substrate
Meas. Tech.
ChEMBL_469831 (CHEMBL949020)
IC50
45±n/a nM
Citation
 Goldberg, DRChoi, YCogan, DCorson, MDeLeon, RGao, AGruenbaum, LHao, MHJoseph, DKashem, MAMiller, CMoss, NNetherton, MRPargellis, CPPelletier, JSellati, RSkow, DTorcellini, CTseng, YCWang, JWasti, RWerneburg, BWu, JPXiong, Z Pyrazinoindolone inhibitors of MAPKAP-K2. Bioorg Med Chem Lett 18:938-41 (2008)  
Target
Name:
MAP kinase-activated protein kinase 2
Synonyms:
MAP kinase-activated protein kinase 2 (MAPKAPK2) MAP kinase-activated protein kinase 2 (p38/MK2) MAPK-activated protein kinase 2 MAPKAP kinase 2 MAPKAPK2 | MK2
Type:
Serine/threonine-protein kinase
Mol. Mass.:
45579.87
Organism:
Homo sapiens (Human)
Description:
P49137
Residue:
400
  
Inhibitor
Name:
BDBM50374691
Synonyms:
CHEMBL437033
Type:
Small organic molecule
Emp. Form.:
C24H27N5O3S
Mol. Mass.:
465.568
SMILES:
CC1CCC(CC1)NC(=O)c1csc(NC(=O)c2ccc3cc4C(=O)NCC(C)n4c3c2)n1
: