Target
Lanosterol 14-alpha demethylase
Ligand
BDBM25817
Substrate
Meas. Tech.
ChEMBL_470781 (CHEMBL934979)
Kd
120000±n/a nM
Citation
 Ekins, SMankowski, DCHoover, DJLawton, MPTreadway, JLHarwood, HJ Three-dimensional quantitative structure-activity relationship analysis of human CYP51 inhibitors. Drug Metab Dispos 35:493-500 (2007)  
Target
Name:
Lanosterol 14-alpha demethylase
Synonyms:
CP51A_HUMAN CYP51A1 Cytochrome P450 51 LDM P450-14DM P450LI Sterol 14-alpha demethylase
Type:
Protein
Mol. Mass.:
56817.21
Organism:
Homo sapiens (Human)
Description:
Q16850
Residue:
509
  
Inhibitor
Name:
BDBM25817
Synonyms:
2-(2,4-difluorophenyl)-1,3-bis(1H-1,2,4-triazol-1-yl)propan-2-ol Diflucan Fluconazole (f) Triflucan US11247981, Example Fluconazole US9144538, Fluconazole US9556143, Fluconazole | cid_3365
Type:
Small organic molecule
Emp. Form.:
C13H12F2N6O
Mol. Mass.:
306.2708
SMILES:
OC(Cn1cncn1)(Cn1cncn1)c1ccc(F)cc1F
: