Target
Solute carrier family 22 member 5
Ligand
BDBM50375328
Substrate
Meas. Tech.
ChEMBL_471112 (CHEMBL921265)
IC50
443000±n/a nM
Citation
 Piermatti, OFringuelli, FPochini, LIndiveri, CPalmerini, CA Synthesis and characterization of carnitine nitro-derivatives. Bioorg Med Chem 16:1444-51 (2008)  
Target
Name:
Solute carrier family 22 member 5
Synonyms:
CT1 OCTN2_RAT Organic cation/carnitine transporter 2 UST2r
Type:
PROTEIN
Mol. Mass.:
62570.99
Organism:
Rattus norvegicus
Description:
ChEMBL_471112
Residue:
557
  
Inhibitor
Name:
BDBM50375328
Synonyms:
CHEMBL410276
Type:
Small organic molecule
Emp. Form.:
C25H49N2O7
Mol. Mass.:
489.6652
SMILES:
CCOC(=O)C[C@@H](C[N+](C)(C)C)OC(=O)CCCCCCCCCCCCCCCO[N+]([O-])=O
: