Target
5-hydroxytryptamine receptor 2B
Ligand
BDBM50375450
Substrate
Meas. Tech.
ChEMBL_472651 (CHEMBL921967)
EC50
3.2±n/a nM
Citation
 Shimada, IMaeno, KKazuta, KKubota, HKimizuka, TKimura, YHatanaka, KNaitou, YWanibuchi, FSakamoto, STsukamoto, S Synthesis and structure-activity relationships of a series of substituted 2-(1H-furo[2,3-g]indazol-1-yl)ethylamine derivatives as 5-HT2C receptor agonists. Bioorg Med Chem 16:1966-82 (2008)  
Target
Name:
5-hydroxytryptamine receptor 2B
Synonyms:
5-HT-2B 5-hydroxytryptamine (serotonin) receptor 2B [Homo sapiens] 5-hydroxytryptamine receptor 2C (5HT2C) HTR2B Serotonin 2b (5-HT2b) receptor | Serotonin Receptor 2B
Type:
G Protein-Coupled Receptor (GPCR)
Mol. Mass.:
54312.47
Organism:
Homo sapiens (Human)
Description:
Receptor binding assays were performed using human clone stably expressed in CHO cells.
Residue:
481
  
Inhibitor
Name:
BDBM50375450
Synonyms:
CHEMBL407909 | YM-348
Type:
Small organic molecule
Emp. Form.:
C14H17N3O
Mol. Mass.:
243.3043
SMILES:
CCc1cc2c(ccc3cnn(C[C@H](C)N)c23)o1
: