Target
Sucrase-isomaltase, intestinal
Ligand
BDBM50031481
Substrate
Meas. Tech.
ChEMBL_472704 (CHEMBL923888)
IC50
290000±n/a nM
Citation
 Minami, YKuriyama, CIkeda, KKato, ATakebayashi, KAdachi, IFleet, GWKettawan, AOkamoto, TAsano, N Effect of five-membered sugar mimics on mammalian glycogen-degrading enzymes and various glucosidases. Bioorg Med Chem 16:2734-40 (2008)  
Target
Name:
Sucrase-isomaltase, intestinal
Synonyms:
SUIS_RAT Sucrase-isomaltase | alpha-Glucosidase (α-Glucosidase)
Type:
Enzyme
Mol. Mass.:
210329.04
Organism:
Rattus norvegicus (Rat)
Description:
P23739
Residue:
1841
  
Inhibitor
Name:
BDBM50031481
Synonyms:
(2R,3R,4R,5R)-2,5-Bis-hydroxymethyl-pyrrolidine-3,4-diol 2R,5R-dihydroxymethyl-3R,4R-dihydroxypyrrolidine | CHEMBL312653
Type:
Small organic molecule
Emp. Form.:
C6H13NO4
Mol. Mass.:
163.1717
SMILES:
OC[C@H]1N[C@H](CO)[C@@H](O)[C@@H]1O
: