Target
Prostaglandin G/H synthase 1
Ligand
BDBM13066
Substrate
Meas. Tech.
ChEMBL_473074 (CHEMBL921732)
IC50
67±n/a nM
Citation
 Blobaum, ALMarnett, LJ Molecular determinants for the selective inhibition of cyclooxygenase-2 by lumiracoxib. J Biol Chem 282:16379-90 (2007)  
Target
Name:
Prostaglandin G/H synthase 1
Synonyms:
COX1 Cyclooxygenase-1 (COX-1) PTGS1 | Prostaglandin G/H synthase (cyclooxygenase)
Type:
Protein
Mol. Mass.:
68868.60
Organism:
Ovis aries (Sheep)
Description:
Residue:
600
  
Inhibitor
Name:
BDBM13066
Synonyms:
2-{2-[(2,6-dichlorophenyl)amino]phenyl}acetic acid Diclofenac US11478464, Compound Diclofenac {2-[(2,6-dichlorophenyl)amino]phenyl}acetic acid
Type:
Small organic molecule
Emp. Form.:
C14H11Cl2NO2
Mol. Mass.:
296.149
SMILES:
OC(=O)Cc1ccccc1Nc1c(Cl)cccc1Cl
: