Target
Myosin light chain kinase, smooth muscle
Ligand
BDBM92455
Substrate
Meas. Tech.
ChEMBL_473613 (CHEMBL939381)
IC50
31800±n/a nM
Citation
 Fedorov, OMarsden, BPogacic, VRellos, PMüller, SBullock, ANSchwaller, JSundström, MKnapp, S A systematic interaction map of validated kinase inhibitors with Ser/Thr kinases. Proc Natl Acad Sci U S A 104:20523-8 (2007)  
Target
Name:
Myosin light chain kinase, smooth muscle
Synonyms:
KRP MLCK MYLK MYLK_HUMAN Telokin | smMLCK
Type:
Protein
Mol. Mass.:
210702.56
Organism:
Homo sapiens (Human)
Description:
Q15746
Residue:
1914
  
Inhibitor
Name:
BDBM92455
Synonyms:
CHEMBL265470 | STO-609
Type:
Small organic molecule
Emp. Form.:
C19H10N2O3
Mol. Mass.:
314.2943
SMILES:
OC(=O)c1ccc2c3nc4ccccc4n3c(=O)c3cccc1c23
: