Target
Mitogen-activated protein kinase 1
Ligand
BDBM92455
Substrate
Meas. Tech.
ChEMBL_473589 (CHEMBL939354)
IC50
>31800±n/a nM
Citation
 Fedorov, OMarsden, BPogacic, VRellos, PMüller, SBullock, ANSchwaller, JSundström, MKnapp, S A systematic interaction map of validated kinase inhibitors with Ser/Thr kinases. Proc Natl Acad Sci U S A 104:20523-8 (2007)  
Target
Name:
Mitogen-activated protein kinase 1
Synonyms:
ERK2 Extracellular signal-regulated kinase 2 Extracellular signal-regulated kinase 2 (ERK2) MAPK 2 MK01_HUMAN Mitogen-activated protein kinase 1 (ERK-2) Mitogen-activated protein kinase 2 PRKM2 | p42-MAPK
Type:
Ser/Thr Protein Kinase
Mol. Mass.:
41392.76
Organism:
Homo sapiens (Human)
Description:
P28482
Residue:
360
  
Inhibitor
Name:
BDBM92455
Synonyms:
CHEMBL265470 | STO-609
Type:
Small organic molecule
Emp. Form.:
C19H10N2O3
Mol. Mass.:
314.2943
SMILES:
OC(=O)c1ccc2c3nc4ccccc4n3c(=O)c3cccc1c23
: