Target
Receptor tyrosine-protein kinase erbB-2
Ligand
BDBM50179207
Substrate
Meas. Tech.
ChEMBL_473602 (CHEMBL939367)
IC50
>10000±n/a nM
Citation
 Fedorov, OMarsden, BPogacic, VRellos, PMüller, SBullock, ANSchwaller, JSundström, MKnapp, S A systematic interaction map of validated kinase inhibitors with Ser/Thr kinases. Proc Natl Acad Sci U S A 104:20523-8 (2007)  
Target
Name:
Receptor tyrosine-protein kinase erbB-2
Synonyms:
2.7.10.1 CD_antigen=CD340 ERBB2_HUMAN FASN/HER2 HER2 MLN19 NEU Proto-oncogene Neu Tyrosine kinase-type cell surface receptor HER2 | p185erbB2
Type:
Mol. Mass.:
137894.47
Organism:
Homo sapiens (Human)
Description:
P04626
Residue:
1255
  
Inhibitor
Name:
BDBM50179207
Synonyms:
3-fluoro-N-(6,7-dimethoxy-2,4-dihydroindeno[1,2-c]pyrazol-3-yl)phenylamine JNJ-10198409
Type:
Small organic molecule
Emp. Form.:
C18H16FN3O2
Mol. Mass.:
325.3369
SMILES:
COc1cc2Cc3c(Nc4cccc(F)c4)[nH]nc3-c2cc1OC
: