Target
Cyclin-dependent kinase 7
Ligand
BDBM50179207
Substrate
Meas. Tech.
ChEMBL_473633 (CHEMBL937649)
IC50
>10000±n/a nM
Citation
 Fedorov, OMarsden, BPogacic, VRellos, PMüller, SBullock, ANSchwaller, JSundström, MKnapp, S A systematic interaction map of validated kinase inhibitors with Ser/Thr kinases. Proc Natl Acad Sci U S A 104:20523-8 (2007)  
Target
Name:
Cyclin-dependent kinase 7
Synonyms:
39 kDa protein kinase CAK1 CDK-activating kinase 1 (CAK) CDK7_HUMAN Cell division protein kinase 7 Cyclin-dependent kinase 7 (CDK7/cyclin H) P39 Mo15 TFIIH basal transcription factor complex kinase subunit
Type:
Enzyme Subunit
Mol. Mass.:
39047.01
Organism:
Homo sapiens (Human)
Description:
Residue:
346
  
Inhibitor
Name:
BDBM50179207
Synonyms:
3-fluoro-N-(6,7-dimethoxy-2,4-dihydroindeno[1,2-c]pyrazol-3-yl)phenylamine JNJ-10198409
Type:
Small organic molecule
Emp. Form.:
C18H16FN3O2
Mol. Mass.:
325.3369
SMILES:
COc1cc2Cc3c(Nc4cccc(F)c4)[nH]nc3-c2cc1OC
: