Target
DNA polymerase beta
Ligand
BDBM50237597
Substrate
Meas. Tech.
ChEMBL_476056 (CHEMBL921744)
IC50
38880±n/a nM
Citation
 Gao, ZMaloney, DJDedkova, LMHecht, SM Inhibitors of DNA polymerase beta: activity and mechanism. Bioorg Med Chem 16:4331-40 (2008)  
Target
Name:
DNA polymerase beta
Synonyms:
DNA polymerase beta (Pol β) POLB
Type:
Protein
Mol. Mass.:
38188.76
Organism:
Homo sapiens (Human)
Description:
Residue:
335
  
Inhibitor
Name:
BDBM50237597
Synonyms:
7-hydroxy-3,7'-dicoumaryl ether CHEMBL259025
Type:
Small organic molecule
Emp. Form.:
C18H10O6
Mol. Mass.:
322.2684
SMILES:
Oc1ccc2cc(Oc3ccc4ccc(=O)oc4c3)c(=O)oc2c1
: