Target
DNA polymerase beta
Ligand
BDBM50346601
Substrate
Meas. Tech.
ChEMBL_476057 (CHEMBL921745)
IC50
24980±n/a nM
Citation
 Gao, ZMaloney, DJDedkova, LMHecht, SM Inhibitors of DNA polymerase beta: activity and mechanism. Bioorg Med Chem 16:4331-40 (2008)  
Target
Name:
DNA polymerase beta
Synonyms:
DNA polymerase beta (Pol β) POLB
Type:
Protein
Mol. Mass.:
38188.76
Organism:
Homo sapiens (Human)
Description:
Residue:
335
  
Inhibitor
Name:
BDBM50346601
Synonyms:
NSC-114945 Oleanolic acid US11660306, Example Oleanolic acid
Type:
Small organic molecule
Emp. Form.:
C30H48O3
Mol. Mass.:
456.7003
SMILES:
CC1(C)CC[C@@]2(CC[C@]3(C)C(=CC[C@@H]4[C@@]5(C)CC[C@H](O)C(C)(C)[C@@H]5CC[C@@]34C)[C@@H]2C1)C(O)=O
: