Target
DNA polymerase beta
Ligand
BDBM50376364
Substrate
Meas. Tech.
ChEMBL_476057 (CHEMBL921745)
IC50
>250000±n/a nM
Citation
 Gao, ZMaloney, DJDedkova, LMHecht, SM Inhibitors of DNA polymerase beta: activity and mechanism. Bioorg Med Chem 16:4331-40 (2008)  
Target
Name:
DNA polymerase beta
Synonyms:
DNA polymerase beta (Pol β) POLB
Type:
Protein
Mol. Mass.:
38188.76
Organism:
Homo sapiens (Human)
Description:
Residue:
335
  
Inhibitor
Name:
BDBM50376364
Synonyms:
STIGMASTEROL
Type:
Small organic molecule
Emp. Form.:
C29H48O
Mol. Mass.:
412.6908
SMILES:
CC[C@H](\C=C\[C@@H](C)[C@H]1CC[C@H]2[C@@H]3CC=C4C[C@@H](O)CC[C@]4(C)[C@H]3CC[C@]12C)C(C)C
: