Target
Caspase-2
Ligand
BDBM79403
Substrate
Meas. Tech.
ChEMBL_476696 (CHEMBL933486)
EC50
8500±n/a nM
Citation
 Goode, DRTotten, RKHeeres, JTHergenrother, PJ Identification of promiscuous small molecule activators in high-throughput enzyme activation screens. J Med Chem 51:2346-9 (2008)  
Target
Name:
Caspase-2
Synonyms:
CASP-2 CASP2_HUMAN Caspase-2 subunit p13 ICH-1 protease ICH1 NEDD2 | Neural precursor cell expressed developmentally down-regulated protein 2
Type:
Enzyme
Mol. Mass.:
50688.29
Organism:
Homo sapiens (Human)
Description:
P42575
Residue:
452
  
Inhibitor
Name:
BDBM79403
Synonyms:
3-aminopropyl-[4-(3-aminopropylamino)butyl]amine;hydrochloride MLS002472980 N,N''-bis(3-azanylpropyl)butane-1,4-diamine;hydrochloride SMR001397086 cid_5351186 | spermidine 3HCl
Type:
Small organic molecule
Emp. Form.:
C10H26N4
Mol. Mass.:
202.3402
SMILES:
NCCCNCCCCNCCCN
: