Target
Tyrosine-protein phosphatase non-receptor type 1
Ligand
BDBM50171100
Substrate
Meas. Tech.
ChEMBL_477674 (CHEMBL924740)
IC50
74±n/a nM
Citation
 Holmes, CPLi, XPan, YXu, CBhandari, AMoody, CMMiguel, JAFerla, SWDe Francisco, MNFrederick, BTZhou, SMacher, NJang, LIrvine, JDGrove, JR PTP1B inhibitors: synthesis and evaluation of difluoro-methylenephosphonate bioisosteres on a sulfonamide scaffold. Bioorg Med Chem Lett 18:2719-24 (2008)  
Target
Name:
Tyrosine-protein phosphatase non-receptor type 1
Synonyms:
PTN1_HUMAN PTPN1 Protein tyrosine phosphatase-1B (PTP1B) Protein-tyrosine phosphatase 1B (PTP1B) Tyrosine-protein phosphatase non-receptor type 1 (PTP1B)
Type:
Protein phosphatase
Mol. Mass.:
49963.76
Organism:
Homo sapiens (Human)
Description:
Human recombinant GST-fusion PTP1B (1-435).
Residue:
435
  
Inhibitor
Name:
BDBM50171100
Synonyms:
CHEMBL198882 | {4-[[4-(Difluoro-phosphono-methyl)-benzyl]-(4-[1,2,3]thiadiazol-4-yl-benzyl)-sulfamoyl]-phenoxy}-acetic acid
Type:
Small organic molecule
Emp. Form.:
C25H22F2N3O8PS2
Mol. Mass.:
625.558
SMILES:
OC(=O)COc1ccc(cc1)S(=O)(=O)N(Cc1ccc(cc1)-c1csnn1)Cc1ccc(cc1)C(F)(F)P(O)(O)=O
: