Target
Tyrosine-protein phosphatase non-receptor type 1
Ligand
BDBM50376608
Substrate
Meas. Tech.
ChEMBL_477674 (CHEMBL924740)
IC50
29100±n/a nM
Citation
 Holmes, CPLi, XPan, YXu, CBhandari, AMoody, CMMiguel, JAFerla, SWDe Francisco, MNFrederick, BTZhou, SMacher, NJang, LIrvine, JDGrove, JR PTP1B inhibitors: synthesis and evaluation of difluoro-methylenephosphonate bioisosteres on a sulfonamide scaffold. Bioorg Med Chem Lett 18:2719-24 (2008)  
Target
Name:
Tyrosine-protein phosphatase non-receptor type 1
Synonyms:
PTN1_HUMAN PTPN1 Protein tyrosine phosphatase-1B (PTP1B) Protein-tyrosine phosphatase 1B (PTP1B) Tyrosine-protein phosphatase non-receptor type 1 (PTP1B)
Type:
Protein phosphatase
Mol. Mass.:
49963.76
Organism:
Homo sapiens (Human)
Description:
Human recombinant GST-fusion PTP1B (1-435).
Residue:
435
  
Inhibitor
Name:
BDBM50376608
Synonyms:
CHEMBL410332
Type:
Small organic molecule
Emp. Form.:
C27H21N3O8S2
Mol. Mass.:
579.601
SMILES:
OC(=O)COc1ccc(cc1)S(=O)(=O)N(Cc1ccc(cc1)-c1csnn1)Cc1ccc2oc(cc2c1)C(O)=O
: