Target
Tyrosine-protein phosphatase non-receptor type 1
Ligand
BDBM50376618
Substrate
Meas. Tech.
ChEMBL_477674 (CHEMBL924740)
IC50
53800±n/a nM
Citation
 Holmes, CPLi, XPan, YXu, CBhandari, AMoody, CMMiguel, JAFerla, SWDe Francisco, MNFrederick, BTZhou, SMacher, NJang, LIrvine, JDGrove, JR PTP1B inhibitors: synthesis and evaluation of difluoro-methylenephosphonate bioisosteres on a sulfonamide scaffold. Bioorg Med Chem Lett 18:2719-24 (2008)  
Target
Name:
Tyrosine-protein phosphatase non-receptor type 1
Synonyms:
PTN1_HUMAN PTPN1 Protein tyrosine phosphatase-1B (PTP1B) Protein-tyrosine phosphatase 1B (PTP1B) Tyrosine-protein phosphatase non-receptor type 1 (PTP1B)
Type:
Protein phosphatase
Mol. Mass.:
49963.76
Organism:
Homo sapiens (Human)
Description:
Human recombinant GST-fusion PTP1B (1-435).
Residue:
435
  
Inhibitor
Name:
BDBM50376618
Synonyms:
CHEMBL258463
Type:
Small organic molecule
Emp. Form.:
C24H20ClN3O5S2
Mol. Mass.:
530.016
SMILES:
OC(=O)COc1ccc(CN(Cc2ccc(cc2)-c2csnn2)S(=O)(=O)c2ccccc2)cc1Cl
: