Target
Tyrosine-protein phosphatase non-receptor type 1
Ligand
BDBM50376632
Substrate
Meas. Tech.
ChEMBL_477674 (CHEMBL924740)
IC50
63600±n/a nM
Citation
 Holmes, CPLi, XPan, YXu, CBhandari, AMoody, CMMiguel, JAFerla, SWDe Francisco, MNFrederick, BTZhou, SMacher, NJang, LIrvine, JDGrove, JR PTP1B inhibitors: synthesis and evaluation of difluoro-methylenephosphonate bioisosteres on a sulfonamide scaffold. Bioorg Med Chem Lett 18:2719-24 (2008)  
Target
Name:
Tyrosine-protein phosphatase non-receptor type 1
Synonyms:
PTN1_HUMAN PTPN1 Protein tyrosine phosphatase-1B (PTP1B) Protein-tyrosine phosphatase 1B (PTP1B) Tyrosine-protein phosphatase non-receptor type 1 (PTP1B)
Type:
Protein phosphatase
Mol. Mass.:
49963.76
Organism:
Homo sapiens (Human)
Description:
Human recombinant GST-fusion PTP1B (1-435).
Residue:
435
  
Inhibitor
Name:
BDBM50376632
Synonyms:
CHEMBL264144
Type:
Small organic molecule
Emp. Form.:
C25H19N3O5S2
Mol. Mass.:
505.565
SMILES:
OC(=O)c1cc2cc(CN(Cc3ccc(cc3)-c3csnn3)S(=O)(=O)c3ccccc3)ccc2o1
: