Target
Adenosine receptor A2b
Ligand
BDBM50119168
Substrate
Meas. Tech.
ChEMBL_478884 (CHEMBL937355)
EC50
10000±n/a nM
Citation
 Ivanov, AAWang, BKlutz, AMChen, VLGao, ZGJacobson, KA Probing distal regions of the A2B adenosine receptor by quantitative structure-activity relationship modeling of known and novel agonists. J Med Chem 51:2088-99 (2008)  
Target
Name:
Adenosine receptor A2b
Synonyms:
AA2BR_HUMAN ADORA2B Adenosine receptors A2b | Adenosine receptors; A2a & A2b
Type:
G Protein-Coupled Receptor (GPCR)
Mol. Mass.:
36341.22
Organism:
Homo sapiens (Human)
Description:
Residue:
332
  
Inhibitor
Name:
BDBM50119168
Synonyms:
(2R,3R,4S,5R)-2-(6-Amino-2-hex-1-ynyl-purin-9-yl)-5-hydroxymethyl-tetrahydro-furan-3,4-diol (2R,3R,4S,5R)-2-(6-amino-2-(hex-1-ynyl)-9H-purin-9-yl)-5-(hydroxymethyl)tetrahydrofuran-3,4-diol CHEMBL319387
Type:
Small organic molecule
Emp. Form.:
C16H21N5O4
Mol. Mass.:
347.369
SMILES:
CCCCC#Cc1nc(N)c2ncn([C@@H]3O[C@H](CO)[C@@H](O)[C@H]3O)c2n1
: