Target
Sodium-dependent serotonin transporter
Ligand
BDBM50377572
Substrate
Meas. Tech.
ChEMBL_479728 (CHEMBL929225)
IC50
10±n/a nM
Citation
 Whitlock, GAFish, PVFray, MJStobie, AWakenhut, F Pyridyl-phenyl ether monoamine reuptake inhibitors: Impact of lipophilicity on dual SNRI pharmacology and off-target promiscuity. Bioorg Med Chem Lett 18:2896-9 (2008)  
Target
Name:
Sodium-dependent serotonin transporter
Synonyms:
5-HT Transporter 5HTT SC6A4_HUMAN SLC6A4 Serotonin transporter (5HTT) Sodium-dependent serotonin transporter (SERT) | Solute carrier family 6 member 4
Type:
Multi-pass membrane protein
Mol. Mass.:
70322.51
Organism:
Homo sapiens (Human)
Description:
P31645
Residue:
630
  
Inhibitor
Name:
BDBM50377572
Synonyms:
CHEMBL402371
Type:
Small organic molecule
Emp. Form.:
C14H14BrClN2O
Mol. Mass.:
341.631
SMILES:
CNCc1cnc(C)cc1Oc1ccc(Cl)cc1Br
: