Target
Sodium-dependent serotonin transporter
Ligand
BDBM50375708
Substrate
Meas. Tech.
ChEMBL_479728 (CHEMBL929225)
IC50
20±n/a nM
Citation
 Whitlock, GAFish, PVFray, MJStobie, AWakenhut, F Pyridyl-phenyl ether monoamine reuptake inhibitors: Impact of lipophilicity on dual SNRI pharmacology and off-target promiscuity. Bioorg Med Chem Lett 18:2896-9 (2008)  
Target
Name:
Sodium-dependent serotonin transporter
Synonyms:
5-HT Transporter 5HTT SC6A4_HUMAN SLC6A4 Serotonin transporter (5HTT) Sodium-dependent serotonin transporter (SERT) | Solute carrier family 6 member 4
Type:
Multi-pass membrane protein
Mol. Mass.:
70322.51
Organism:
Homo sapiens (Human)
Description:
P31645
Residue:
630
  
Inhibitor
Name:
BDBM50375708
Synonyms:
CHEMBL403251
Type:
Small organic molecule
Emp. Form.:
C16H19ClN2O
Mol. Mass.:
290.788
SMILES:
CCc1cc(Cl)ccc1Oc1cc(C)ncc1CNC
: