Target
Sodium-dependent noradrenaline transporter
Ligand
BDBM50377569
Substrate
Meas. Tech.
ChEMBL_479729 (CHEMBL929226)
IC50
25±n/a nM
Citation
 Whitlock, GAFish, PVFray, MJStobie, AWakenhut, F Pyridyl-phenyl ether monoamine reuptake inhibitors: Impact of lipophilicity on dual SNRI pharmacology and off-target promiscuity. Bioorg Med Chem Lett 18:2896-9 (2008)  
Target
Name:
Sodium-dependent noradrenaline transporter
Synonyms:
Monoamine transporter NET Noradrenaline Transporter (NET) Norepinephrine transporter protein (NET) SLC6A2 Sodium-dependent noradrenaline transporter (NET) | Solute carrier family 6 member 2
Type:
Multi-pass membrane protein
Mol. Mass.:
69337.72
Organism:
Homo sapiens (Human)
Description:
P23975
Residue:
617
  
Inhibitor
Name:
BDBM50377569
Synonyms:
CHEMBL260036
Type:
Small organic molecule
Emp. Form.:
C14H14Cl2N2O
Mol. Mass.:
297.18
SMILES:
CN(C)Cc1cnccc1Oc1ccc(Cl)cc1Cl
: