Target
Sodium-dependent noradrenaline transporter
Ligand
BDBM50377578
Substrate
Meas. Tech.
ChEMBL_479729 (CHEMBL929226)
IC50
26±n/a nM
Citation
 Whitlock, GAFish, PVFray, MJStobie, AWakenhut, F Pyridyl-phenyl ether monoamine reuptake inhibitors: Impact of lipophilicity on dual SNRI pharmacology and off-target promiscuity. Bioorg Med Chem Lett 18:2896-9 (2008)  
Target
Name:
Sodium-dependent noradrenaline transporter
Synonyms:
Monoamine transporter NET Noradrenaline Transporter (NET) Norepinephrine transporter protein (NET) SLC6A2 Sodium-dependent noradrenaline transporter (NET) | Solute carrier family 6 member 2
Type:
Multi-pass membrane protein
Mol. Mass.:
69337.72
Organism:
Homo sapiens (Human)
Description:
P23975
Residue:
617
  
Inhibitor
Name:
BDBM50377578
Synonyms:
CHEMBL403080
Type:
Small organic molecule
Emp. Form.:
C16H19ClN2O2
Mol. Mass.:
306.787
SMILES:
COc1cc(Cl)ccc1Oc1cc(C)ncc1CN(C)C
: