Target
Sodium-dependent dopamine transporter
Ligand
BDBM50203945
Substrate
Meas. Tech.
ChEMBL_479730 (CHEMBL929227)
IC50
727±n/a nM
Citation
 Whitlock, GAFish, PVFray, MJStobie, AWakenhut, F Pyridyl-phenyl ether monoamine reuptake inhibitors: Impact of lipophilicity on dual SNRI pharmacology and off-target promiscuity. Bioorg Med Chem Lett 18:2896-9 (2008)  
Target
Name:
Sodium-dependent dopamine transporter
Synonyms:
DA transporter DAT1 Dopamine transporter protein (DAT) SC6A3_HUMAN Sodium-dependent dopamine transporter Solute carrier family 6 member 3
Type:
Multi-pass membrane protein
Mol. Mass.:
68497.11
Organism:
Homo sapiens (Human)
Description:
Q01959
Residue:
620
  
Inhibitor
Name:
BDBM50203945
Synonyms:
(S)-N-(2,3-dimethylbenzyl)-N-(tetrahydro-2H-pyran-4-yl)pyrrolidin-3-amine | CHEMBL247733
Type:
Small organic molecule
Emp. Form.:
C18H28N2O
Mol. Mass.:
288.4277
SMILES:
Cc1cccc(CN([C@H]2CCNC2)C2CCOCC2)c1C
: