Target
Sodium-dependent serotonin transporter
Ligand
BDBM50203945
Substrate
Meas. Tech.
ChEMBL_479728 (CHEMBL929225)
IC50
9±n/a nM
Citation
 Whitlock, GAFish, PVFray, MJStobie, AWakenhut, F Pyridyl-phenyl ether monoamine reuptake inhibitors: Impact of lipophilicity on dual SNRI pharmacology and off-target promiscuity. Bioorg Med Chem Lett 18:2896-9 (2008)  
Target
Name:
Sodium-dependent serotonin transporter
Synonyms:
5-HT Transporter 5HTT SC6A4_HUMAN SLC6A4 Serotonin transporter (5HTT) Sodium-dependent serotonin transporter (SERT) | Solute carrier family 6 member 4
Type:
Multi-pass membrane protein
Mol. Mass.:
70322.51
Organism:
Homo sapiens (Human)
Description:
P31645
Residue:
630
  
Inhibitor
Name:
BDBM50203945
Synonyms:
(S)-N-(2,3-dimethylbenzyl)-N-(tetrahydro-2H-pyran-4-yl)pyrrolidin-3-amine | CHEMBL247733
Type:
Small organic molecule
Emp. Form.:
C18H28N2O
Mol. Mass.:
288.4277
SMILES:
Cc1cccc(CN([C@H]2CCNC2)C2CCOCC2)c1C
: