Target
Vascular endothelial growth factor receptor 2
Ligand
BDBM9503
Substrate
Meas. Tech.
ChEMBL_479743 (CHEMBL929240)
IC50
23±n/a nM
Citation
 Honda, TTajima, HKaneko, YBan, MInaba, TTakeno, YOkamoto, KAono, H Conformation-activity relationship on novel 4-pyridylmethylthio derivatives with antiangiogenic activity. Bioorg Med Chem Lett 18:2939-43 (2008)  
Target
Name:
Vascular endothelial growth factor receptor 2
Synonyms:
CD_antigen=CD309 Fetal liver kinase 1 (FLK-1) KDR Protein-tyrosine kinase receptor Flk-1 VEGFR-2 VEGFR2 Vascular Endothelial Growth Factor Receptor Kinase 2 Vascular endothelial growth factor receptor 2 (KDR) Vascular endothelial growth factor receptor 2 (VEGFR2) Vascular endothelial growth factor receptor-2 (VEGFR-2)
Type:
Receptor Tyrosine Kinase
Mol. Mass.:
151510.97
Organism:
Homo sapiens (Human)
Description:
P35968
Residue:
1356
  
Inhibitor
Name:
BDBM9503
Synonyms:
2-[(pyridin-4-ylmethyl)amino]-N-[3-(trifluoromethyl)phenyl]benzamide anthranyl amide derivative C
Type:
Small organic molecule
Emp. Form.:
C20H16F3N3O
Mol. Mass.:
371.3557
SMILES:
FC(F)(F)c1cccc(NC(=O)c2ccccc2NCc2ccncc2)c1
: