Target
Adenosine receptor A2a
Ligand
BDBM50163031
Substrate
Meas. Tech.
ChEMBL_479906 (CHEMBL935759)
Ki
1600±n/a nM
Citation
 Melman, AGao, ZGKumar, DWan, TCGizewski, EAuchampach, JAJacobson, KA Design of (N)-methanocarba adenosine 5'-uronamides as species-independent A3 receptor-selective agonists. Bioorg Med Chem Lett 18:2813-9 (2008)  
Target
Name:
Adenosine receptor A2a
Synonyms:
A2A adenosine receptor (hA2A) ADENOSINE A2 ADORA2 Adenosine A2A receptor (A2AAR)
Type:
G Protein-Coupled Receptor (GPCR)
Mol. Mass.:
44716.46
Organism:
Homo sapiens (Human)
Description:
P29274
Residue:
412
  
Inhibitor
Name:
BDBM50163031
Synonyms:
(1S,2R,3S,4R,5S)-4-(2-chloro-6-(2,2-diphenylethylamino)-9H-purin-9-yl)-2,3-dihydroxy-N-methylbicyclo[3.1.0]hexane-1-carboxamide CHEMBL368872
Type:
Small organic molecule
Emp. Form.:
C27H27ClN6O3
Mol. Mass.:
518.995
SMILES:
CNC(=O)[C@]12C[C@@H]1[C@H]([C@H](O)[C@@H]2O)n1cnc2c(NCC(c3ccccc3)c3ccccc3)nc(Cl)nc12
: