Target
Small conductance calcium-activated potassium channel protein 3
Ligand
BDBM50377863
Substrate
Meas. Tech.
ChEMBL_480084 (CHEMBL934809)
IC50
3000±n/a nM
Citation
 Graulich, ALamy, CAlleva, LDilly, SChavatte, PWouters, JSeutin, VLiégeois, JF Bis-tetrahydroisoquinoline derivatives: AG525E1, a new step in the search for non-quaternary non-peptidic small conductance Ca(2+)-activated K(+) channel blockers. Bioorg Med Chem Lett 18:3440-5 (2008)  
Target
Name:
Small conductance calcium-activated potassium channel protein 3
Synonyms:
K3 KCNN3_HUMAN Small conductance calcium-activated potassium channel protein 3 (KCa2.3)
Type:
Protein
Mol. Mass.:
82053.75
Organism:
Homo sapiens (Human)
Description:
Q9UGI6
Residue:
731
  
Inhibitor
Name:
BDBM50377863
Synonyms:
AG-525 | CHEMBL257156
Type:
Small organic molecule
Emp. Form.:
C27H38N2O4
Mol. Mass.:
454.6016
SMILES:
COc1cc2CCN(C)[C@@H](CCC[C@@H]3N(C)CCc4cc(OC)c(OC)cc34)c2cc1OC
: