Target
Prostaglandin G/H synthase 1
Ligand
BDBM50242014
Substrate
Meas. Tech.
ChEMBL_551370 (CHEMBL1008496)
IC50
100000±n/a nM
Citation
 Larsson, JGottfries, JBohlin, LBacklund, A Expanding the ChemGPS chemical space with natural products. J Nat Prod 68:985-91 (2005)  
Target
Name:
Prostaglandin G/H synthase 1
Synonyms:
COX-1 Cyclooxygenase Cyclooxygenase-1 (COX-1) PTGS1 | Prostaglandin G/H synthase (cyclooxygenase)
Type:
Enzyme
Mol. Mass.:
68692.62
Organism:
Homo sapiens (Human)
Description:
P23219
Residue:
599
  
Inhibitor
Name:
BDBM50242014
Synonyms:
CHEMBL464006 Morusin, 3 cid_5281671
Type:
Small organic molecule
Emp. Form.:
C25H24O6
Mol. Mass.:
420.4545
SMILES:
[#6]\[#6](-[#6])=[#6]\[#6]-c1c(oc2c3-[#6]=[#6]C([#6])([#6])[#8]-c3cc(-[#8])c2c1=O)-c1ccc(-[#8])cc1-[#8]
: